{"text_format":"1","workbook":"xlsx","n_sheets":4,"sheets":["Küldő-Mérlegkör-Elosztó","Fogyasztói_adatok","Beállítás","Munka"],"not_rendered":{"charts":0,"images":0,"macros":1,"external_links":0,"defined_names":24,"comments":1,"pivot_tables":0},"unopened":[],"bounds":{"document_bytes":16777216,"sheet_cells":100000,"rows_first":2000,"rows_last":500,"rows_between":2000,"halvings":0,"cell_chars":16384,"cell_head_chars":4096},"cells_cut":0,"cells_raw":0,"read":"whole","date_system":"1900"}

{"sheet":"Küldő-Mérlegkör-Elosztó","index":0,"n_rows":19,"n_cols":8,"rows_kept":19,"cut":false,"hidden":false,"merged":[]}
[null,null,"Segéd",null,null,null,"Rövidnév","EIC KÓD"]
[null,"Megnevezés","Tábla azonosító","Kezdő sor","Elem szám","Sor"]
["Kereskedő",null,"Kereskedő",{"$f":"HLOOKUP(C3,Beállítás!$C$2:$IV$3,2,FALSE)","v":113},{"$f":"INDIRECT(\"'Beállítás'!C\" & ('Küldő-Mérlegkör-Elosztó'!D3-2))","v":83},{"$f":"IF(ISERROR(MATCH(B3,INDIRECT(\"'Beállítás'!B\" & D3 & \":B\" & (D3+E3-1)),0)),0,D3+MATCH(B3,INDIRECT(\"'Beállítás'!B\" & D3 & \":B\" & (D3+E3-1)),0)-1)","v":0},{"$f":"INDIRECT(\"'Beállítás'!C\" & $F3)","v":{"$error":"#REF!"}},{"$f":"INDIRECT(\"'Beállítás'!D\" & $F3)","v":{"$error":"#REF!"}}]
["Mérlegkörfelelős",null,"Mérlegkör",{"$f":"HLOOKUP(C4,Beállítás!$C$2:$IV$3,2,FALSE)","v":50},{"$f":"INDIRECT(\"'Beállítás'!C\" & ('Küldő-Mérlegkör-Elosztó'!D4-2))","v":60},{"$f":"IF(ISERROR(MATCH(B4,INDIRECT(\"'Beállítás'!B\" & D4 & \":B\" & (D4+E4-1)),0)),0,D4+MATCH(B4,INDIRECT(\"'Beállítás'!B\" & D4 & \":B\" & (D4+E4-1)),0)-1)","v":0},{"$f":"INDIRECT(\"'Beállítás'!C\" & $F4)","v":{"$error":"#REF!"}},{"$f":"INDIRECT(\"'Beállítás'!D\" & $F4)","v":{"$error":"#REF!"}}]
["Elosztó",null,"Elosztók",{"$f":"HLOOKUP(C5,Beállítás!$C$2:$IV$3,2,FALSE)","v":8},{"$f":"INDIRECT(\"'Beállítás'!C\" & ('Küldő-Mérlegkör-Elosztó'!D5-2))","v":8},{"$f":"IF(ISERROR(MATCH(B5,INDIRECT(\"'Beállítás'!B\" & D5 & \":B\" & (D5+E5-1)),0)),0,D5+MATCH(B5,INDIRECT(\"'Beállítás'!B\" & D5 & \":B\" & (D5+E5-1)),0)-1)","v":0},{"$f":"INDIRECT(\"'Beállítás'!C\" & $F5)","v":{"$error":"#REF!"}},{"$f":"INDIRECT(\"'Beállítás'!D\" & $F5)","v":{"$error":"#REF!"}}]
["Küldő",null,null,null,null,null,{"$f":"VLOOKUP(B6,$B$3:$H$5,6,FALSE)","v":{"$error":"#N/A"}},{"$f":"VLOOKUP(B6,$B$3:$H$5,7,FALSE)","v":{"$error":"#N/A"}}]
[]
[]
[]
[]
["A \"Fogyasztói_adatok\" lapon ezen színnel jelölt fejlécű oszlopok kitöltése kötelező"]
[]
[]
[]
["A \"Fogyasztói_adatok\" lapon ezen színnel jelölt oszlopok kitöltését lista segíti, melyet a mezőre történő kattintással érhet el"]
[]
[]
[]
["A \"Fogyasztói_adatok\" lapon ezen színnel jelölt oszlopok kitöltését automatikus. Ne változtassa!"]

{"sheet":"Fogyasztói_adatok","index":1,"n_rows":57,"n_cols":46,"rows_kept":57,"cut":false,"hidden":false,"merged":[]}
["V21.4",{"$f":"COUNTA($B$8:$B$65000)","v":50},{"$f":"'Küldő-Mérlegkör-Elosztó'!B3","v":0},{"$f":"'Küldő-Mérlegkör-Elosztó'!B4","v":0},null,null,null,null,null,null,null,null,null,null,null,null,null,null,null,null,null,{"$f":"HLOOKUP(\"ProfilCsop\",Beállítás!$C$2:$IV$3,2)","v":24}]
[null,null,null,null,null,null,null,null,null,null,null,null,null,null,null,null,null,null,null,null,null,{"$f":"HLOOKUP(\"ProfilCsop\",Beállítás!$C$2:$IV$4,3)","v":46}]
[null,"Ssz","Küldés dátuma",null,"Státusz",null,"Üzleti partner neve","Fogyasztási hely",null,null,null,null,null,"POD","Mérő",null,"Kereskedő váltás","Szerződés vége","Ellátás alapú","Felhasználó","Profilos fogyasztók esetén",null,null,"Lekötött teljesítmény","RHD","Bejelentett","Leolvasott mérőállások",null,null,null,null,"Fogyasztói kapcsolattartó",null,null,null,"Leolvasás","Csatlakozási",null,"Védendő","Elosztói tarifa","Kiegészítő","Küldő","Kereskedő","Mérlegkörfelelős","Elosztó","Hibakódok"]
[null,null,"Kereskedő","Elosztó","Kereskedő","Elosztó",null,"Azonosító","Szerződésszám","Megnevezés","Cím",null,null,"Mérőpont azonosító","gyáriszám","azonosító","dátuma","(határozatlan idejű","szerződés ","típusa","Profilcsoport",null,"MÉF","(rendelkezésre álló teljesítményig)","fizető","POD","dátuma","Hatásos Vesz",null,null,null,null,null,null,null,"tervezett dátuma","pontok száma",null,null,null,"információk"]
[null,null,"(ééééhhnn)","(ééééhhnn)",null,null,null,null,null,null,"Irsz.","Város","Utca, …",null,null,null,"(ééééhhnn)","esetén: 99991231)","azonosítója",null,"Megnevezés","Kód","kWh","kW",null,null,"(ééééhhnn)","Minden napszakos; kWh","Csúcs; kWh","Völgy; kWh","Mérőszám","Név","Telefon","Fax","e-mail","hhnn","db"]
[null,"Be"]
[null,"Ki"]
[null,1,null,null,null,null,null,null,null,null,null,null,null,null,null,null,null,null,null,null,null,{"$f":"IF(T8<>\"Profilos\",\"\",VLOOKUP(U8,INDIRECT(\"Beállítás!B\" & $V$1 & \":C\" & $V$2),2,FALSE))","v":""},null,null,null,null,null,null,null,null,null,null,null,null,null,null,null,null,null,null,null,{"$f":"IF(AND(ISBLANK(E8),ISBLANK(F8)),\"\",'Küldő-Mérlegkör-Elosztó'!$B$6)","v":""},{"$f":"IF(AND(ISBLANK(E8),ISBLANK(F8)),\"\",'Küldő-Mérlegkör-Elosztó'!$B$3)","v":""},{"$f":"IF(AND(ISBLANK(E8),ISBLANK(F8)),\"\",'Küldő-Mérlegkör-Elosztó'!$B$4)","v":""},{"$f":"IF(AND(ISBLANK(E8),ISBLANK(F8)),\"\",'Küldő-Mérlegkör-Elosztó'!$B$5)","v":""}]
[null,2,null,null,null,null,null,null,null,null,null,null,null,null,null,null,null,null,null,null,null,"",null,null,null,null,null,null,null,null,null,null,null,null,null,null,null,null,null,null,null,{"$f":"IF(AND(ISBLANK(E9),ISBLANK(F9)),\"\",'Küldő-Mérlegkör-Elosztó'!$B$6)","v":""},{"$f":"IF(AND(ISBLANK(E9),ISBLANK(F9)),\"\",'Küldő-Mérlegkör-Elosztó'!$B$3)","v":""},{"$f":"IF(AND(ISBLANK(E9),ISBLANK(F9)),\"\",'Küldő-Mérlegkör-Elosztó'!$B$4)","v":""},{"$f":"IF(AND(ISBLANK(E9),ISBLANK(F9)),\"\",'Küldő-Mérlegkör-Elosztó'!$B$5)","v":""}]
[null,3,null,null,null,null,null,null,null,null,null,null,null,null,null,null,null,null,null,null,null,"",null,null,null,null,null,null,null,null,null,null,null,null,null,null,null,null,null,null,null,{"$f":"IF(AND(ISBLANK(E10),ISBLANK(F10)),\"\",'Küldő-Mérlegkör-Elosztó'!$B$6)","v":""},{"$f":"IF(AND(ISBLANK(E10),ISBLANK(F10)),\"\",'Küldő-Mérlegkör-Elosztó'!$B$3)","v":""},{"$f":"IF(AND(ISBLANK(E10),ISBLANK(F10)),\"\",'Küldő-Mérlegkör-Elosztó'!$B$4)","v":""},{"$f":"IF(AND(ISBLANK(E10),ISBLANK(F10)),\"\",'Küldő-Mérlegkör-Elosztó'!$B$5)","v":""}]
[null,4,null,null,null,null,null,null,null,null,null,null,null,null,null,null,null,null,null,null,null,"",null,null,null,null,null,null,null,null,null,null,null,null,null,null,null,null,null,null,null,{"$f":"IF(AND(ISBLANK(E11),ISBLANK(F11)),\"\",'Küldő-Mérlegkör-Elosztó'!$B$6)","v":""},{"$f":"IF(AND(ISBLANK(E11),ISBLANK(F11)),\"\",'Küldő-Mérlegkör-Elosztó'!$B$3)","v":""},{"$f":"IF(AND(ISBLANK(E11),ISBLANK(F11)),\"\",'Küldő-Mérlegkör-Elosztó'!$B$4)","v":""},{"$f":"IF(AND(ISBLANK(E11),ISBLANK(F11)),\"\",'Küldő-Mérlegkör-Elosztó'!$B$5)","v":""}]
[null,5,null,null,null,null,null,null,null,null,null,null,null,null,null,null,null,null,null,null,null,"",null,null,null,null,null,null,null,null,null,null,null,null,null,null,null,null,null,null,null,{"$f":"IF(AND(ISBLANK(E12),ISBLANK(F12)),\"\",'Küldő-Mérlegkör-Elosztó'!$B$6)","v":""},{"$f":"IF(AND(ISBLANK(E12),ISBLANK(F12)),\"\",'Küldő-Mérlegkör-Elosztó'!$B$3)","v":""},{"$f":"IF(AND(ISBLANK(E12),ISBLANK(F12)),\"\",'Küldő-Mérlegkör-Elosztó'!$B$4)","v":""},{"$f":"IF(AND(ISBLANK(E12),ISBLANK(F12)),\"\",'Küldő-Mérlegkör-Elosztó'!$B$5)","v":""}]
[null,6,null,null,null,null,null,null,null,null,null,null,null,null,null,null,null,null,null,null,null,"",null,null,null,null,null,null,null,null,null,null,null,null,null,null,null,null,null,null,null,{"$f":"IF(AND(ISBLANK(E13),ISBLANK(F13)),\"\",'Küldő-Mérlegkör-Elosztó'!$B$6)","v":""},{"$f":"IF(AND(ISBLANK(E13),ISBLANK(F13)),\"\",'Küldő-Mérlegkör-Elosztó'!$B$3)","v":""},{"$f":"IF(AND(ISBLANK(E13),ISBLANK(F13)),\"\",'Küldő-Mérlegkör-Elosztó'!$B$4)","v":""},{"$f":"IF(AND(ISBLANK(E13),ISBLANK(F13)),\"\",'Küldő-Mérlegkör-Elosztó'!$B$5)","v":""}]
[null,7,null,null,null,null,null,null,null,null,null,null,null,null,null,null,null,null,null,null,null,"",null,null,null,null,null,null,null,null,null,null,null,null,null,null,null,null,null,null,null,{"$f":"IF(AND(ISBLANK(E14),ISBLANK(F14)),\"\",'Küldő-Mérlegkör-Elosztó'!$B$6)","v":""},{"$f":"IF(AND(ISBLANK(E14),ISBLANK(F14)),\"\",'Küldő-Mérlegkör-Elosztó'!$B$3)","v":""},{"$f":"IF(AND(ISBLANK(E14),ISBLANK(F14)),\"\",'Küldő-Mérlegkör-Elosztó'!$B$4)","v":""},{"$f":"IF(AND(ISBLANK(E14),ISBLANK(F14)),\"\",'Küldő-Mérlegkör-Elosztó'!$B$5)","v":""}]
[null,8,null,null,null,null,null,null,null,null,null,null,null,null,null,null,null,null,null,null,null,"",null,null,null,null,null,null,null,null,null,null,null,null,null,null,null,null,null,null,null,{"$f":"IF(AND(ISBLANK(E15),ISBLANK(F15)),\"\",'Küldő-Mérlegkör-Elosztó'!$B$6)","v":""},{"$f":"IF(AND(ISBLANK(E15),ISBLANK(F15)),\"\",'Küldő-Mérlegkör-Elosztó'!$B$3)","v":""},{"$f":"IF(AND(ISBLANK(E15),ISBLANK(F15)),\"\",'Küldő-Mérlegkör-Elosztó'!$B$4)","v":""},{"$f":"IF(AND(ISBLANK(E15),ISBLANK(F15)),\"\",'Küldő-Mérlegkör-Elosztó'!$B$5)","v":""}]
[null,9,null,null,null,null,null,null,null,null,null,null,null,null,null,null,null,null,null,null,null,"",null,null,null,null,null,null,null,null,null,null,null,null,null,null,null,null,null,null,null,{"$f":"IF(AND(ISBLANK(E16),ISBLANK(F16)),\"\",'Küldő-Mérlegkör-Elosztó'!$B$6)","v":""},{"$f":"IF(AND(ISBLANK(E16),ISBLANK(F16)),\"\",'Küldő-Mérlegkör-Elosztó'!$B$3)","v":""},{"$f":"IF(AND(ISBLANK(E16),ISBLANK(F16)),\"\",'Küldő-Mérlegkör-Elosztó'!$B$4)","v":""},{"$f":"IF(AND(ISBLANK(E16),ISBLANK(F16)),\"\",'Küldő-Mérlegkör-Elosztó'!$B$5)","v":""}]
[null,10,null,null,null,null,null,null,null,null,null,null,null,null,null,null,null,null,null,null,null,"",null,null,null,null,null,null,null,null,null,null,null,null,null,null,null,null,null,null,null,{"$f":"IF(AND(ISBLANK(E17),ISBLANK(F17)),\"\",'Küldő-Mérlegkör-Elosztó'!$B$6)","v":""},{"$f":"IF(AND(ISBLANK(E17),ISBLANK(F17)),\"\",'Küldő-Mérlegkör-Elosztó'!$B$3)","v":""},{"$f":"IF(AND(ISBLANK(E17),ISBLANK(F17)),\"\",'Küldő-Mérlegkör-Elosztó'!$B$4)","v":""},{"$f":"IF(AND(ISBLANK(E17),ISBLANK(F17)),\"\",'Küldő-Mérlegkör-Elosztó'!$B$5)","v":""}]
[null,11,null,null,null,null,null,null,null,null,null,null,null,null,null,null,null,null,null,null,null,"",null,null,null,null,null,null,null,null,null,null,null,null,null,null,null,null,null,null,null,{"$f":"IF(AND(ISBLANK(E18),ISBLANK(F18)),\"\",'Küldő-Mérlegkör-Elosztó'!$B$6)","v":""},{"$f":"IF(AND(ISBLANK(E18),ISBLANK(F18)),\"\",'Küldő-Mérlegkör-Elosztó'!$B$3)","v":""},{"$f":"IF(AND(ISBLANK(E18),ISBLANK(F18)),\"\",'Küldő-Mérlegkör-Elosztó'!$B$4)","v":""},{"$f":"IF(AND(ISBLANK(E18),ISBLANK(F18)),\"\",'Küldő-Mérlegkör-Elosztó'!$B$5)","v":""}]
[null,12,null,null,null,null,null,null,null,null,null,null,null,null,null,null,null,null,null,null,null,"",null,null,null,null,null,null,null,null,null,null,null,null,null,null,null,null,null,null,null,{"$f":"IF(AND(ISBLANK(E19),ISBLANK(F19)),\"\",'Küldő-Mérlegkör-Elosztó'!$B$6)","v":""},{"$f":"IF(AND(ISBLANK(E19),ISBLANK(F19)),\"\",'Küldő-Mérlegkör-Elosztó'!$B$3)","v":""},{"$f":"IF(AND(ISBLANK(E19),ISBLANK(F19)),\"\",'Küldő-Mérlegkör-Elosztó'!$B$4)","v":""},{"$f":"IF(AND(ISBLANK(E19),ISBLANK(F19)),\"\",'Küldő-Mérlegkör-Elosztó'!$B$5)","v":""}]
[null,13,null,null,null,null,null,null,null,null,null,null,null,null,null,null,null,null,null,null,null,"",null,null,null,null,null,null,null,null,null,null,null,null,null,null,null,null,null,null,null,{"$f":"IF(AND(ISBLANK(E20),ISBLANK(F20)),\"\",'Küldő-Mérlegkör-Elosztó'!$B$6)","v":""},{"$f":"IF(AND(ISBLANK(E20),ISBLANK(F20)),\"\",'Küldő-Mérlegkör-Elosztó'!$B$3)","v":""},{"$f":"IF(AND(ISBLANK(E20),ISBLANK(F20)),\"\",'Küldő-Mérlegkör-Elosztó'!$B$4)","v":""},{"$f":"IF(AND(ISBLANK(E20),ISBLANK(F20)),\"\",'Küldő-Mérlegkör-Elosztó'!$B$5)","v":""}]
[null,14,null,null,null,null,null,null,null,null,null,null,null,null,null,null,null,null,null,null,null,"",null,null,null,null,null,null,null,null,null,null,null,null,null,null,null,null,null,null,null,{"$f":"IF(AND(ISBLANK(E21),ISBLANK(F21)),\"\",'Küldő-Mérlegkör-Elosztó'!$B$6)","v":""},{"$f":"IF(AND(ISBLANK(E21),ISBLANK(F21)),\"\",'Küldő-Mérlegkör-Elosztó'!$B$3)","v":""},{"$f":"IF(AND(ISBLANK(E21),ISBLANK(F21)),\"\",'Küldő-Mérlegkör-Elosztó'!$B$4)","v":""},{"$f":"IF(AND(ISBLANK(E21),ISBLANK(F21)),\"\",'Küldő-Mérlegkör-Elosztó'!$B$5)","v":""}]
[null,15,null,null,null,null,null,null,null,null,null,null,null,null,null,null,null,null,null,null,null,"",null,null,null,null,null,null,null,null,null,null,null,null,null,null,null,null,null,null,null,{"$f":"IF(AND(ISBLANK(E22),ISBLANK(F22)),\"\",'Küldő-Mérlegkör-Elosztó'!$B$6)","v":""},{"$f":"IF(AND(ISBLANK(E22),ISBLANK(F22)),\"\",'Küldő-Mérlegkör-Elosztó'!$B$3)","v":""},{"$f":"IF(AND(ISBLANK(E22),ISBLANK(F22)),\"\",'Küldő-Mérlegkör-Elosztó'!$B$4)","v":""},{"$f":"IF(AND(ISBLANK(E22),ISBLANK(F22)),\"\",'Küldő-Mérlegkör-Elosztó'!$B$5)","v":""}]
[null,16,null,null,null,null,null,null,null,null,null,null,null,null,null,null,null,null,null,null,null,"",null,null,null,null,null,null,null,null,null,null,null,null,null,null,null,null,null,null,null,{"$f":"IF(AND(ISBLANK(E23),ISBLANK(F23)),\"\",'Küldő-Mérlegkör-Elosztó'!$B$6)","v":""},{"$f":"IF(AND(ISBLANK(E23),ISBLANK(F23)),\"\",'Küldő-Mérlegkör-Elosztó'!$B$3)","v":""},{"$f":"IF(AND(ISBLANK(E23),ISBLANK(F23)),\"\",'Küldő-Mérlegkör-Elosztó'!$B$4)","v":""},{"$f":"IF(AND(ISBLANK(E23),ISBLANK(F23)),\"\",'Küldő-Mérlegkör-Elosztó'!$B$5)","v":""}]
[null,17,null,null,null,null,null,null,null,null,null,null,null,null,null,null,null,null,null,null,null,"",null,null,null,null,null,null,null,null,null,null,null,null,null,null,null,null,null,null,null,{"$f":"IF(AND(ISBLANK(E24),ISBLANK(F24)),\"\",'Küldő-Mérlegkör-Elosztó'!$B$6)","v":""},{"$f":"IF(AND(ISBLANK(E24),ISBLANK(F24)),\"\",'Küldő-Mérlegkör-Elosztó'!$B$3)","v":""},{"$f":"IF(AND(ISBLANK(E24),ISBLANK(F24)),\"\",'Küldő-Mérlegkör-Elosztó'!$B$4)","v":""},{"$f":"IF(AND(ISBLANK(E24),ISBLANK(F24)),\"\",'Küldő-Mérlegkör-Elosztó'!$B$5)","v":""}]
[null,18,null,null,null,null,null,null,null,null,null,null,null,null,null,null,null,null,null,null,null,"",null,null,null,null,null,null,null,null,null,null,null,null,null,null,null,null,null,null,null,{"$f":"IF(AND(ISBLANK(E25),ISBLANK(F25)),\"\",'Küldő-Mérlegkör-Elosztó'!$B$6)","v":""},{"$f":"IF(AND(ISBLANK(E25),ISBLANK(F25)),\"\",'Küldő-Mérlegkör-Elosztó'!$B$3)","v":""},{"$f":"IF(AND(ISBLANK(E25),ISBLANK(F25)),\"\",'Küldő-Mérlegkör-Elosztó'!$B$4)","v":""},{"$f":"IF(AND(ISBLANK(E25),ISBLANK(F25)),\"\",'Küldő-Mérlegkör-Elosztó'!$B$5)","v":""}]
[null,19,null,null,null,null,null,null,null,null,null,null,null,null,null,null,null,null,null,null,null,"",null,null,null,null,null,null,null,null,null,null,null,null,null,null,null,null,null,null,null,{"$f":"IF(AND(ISBLANK(E26),ISBLANK(F26)),\"\",'Küldő-Mérlegkör-Elosztó'!$B$6)","v":""},{"$f":"IF(AND(ISBLANK(E26),ISBLANK(F26)),\"\",'Küldő-Mérlegkör-Elosztó'!$B$3)","v":""},{"$f":"IF(AND(ISBLANK(E26),ISBLANK(F26)),\"\",'Küldő-Mérlegkör-Elosztó'!$B$4)","v":""},{"$f":"IF(AND(ISBLANK(E26),ISBLANK(F26)),\"\",'Küldő-Mérlegkör-Elosztó'!$B$5)","v":""}]
[null,20,null,null,null,null,null,null,null,null,null,null,null,null,null,null,null,null,null,null,null,"",null,null,null,null,null,null,null,null,null,null,null,null,null,null,null,null,null,null,null,{"$f":"IF(AND(ISBLANK(E27),ISBLANK(F27)),\"\",'Küldő-Mérlegkör-Elosztó'!$B$6)","v":""},{"$f":"IF(AND(ISBLANK(E27),ISBLANK(F27)),\"\",'Küldő-Mérlegkör-Elosztó'!$B$3)","v":""},{"$f":"IF(AND(ISBLANK(E27),ISBLANK(F27)),\"\",'Küldő-Mérlegkör-Elosztó'!$B$4)","v":""},{"$f":"IF(AND(ISBLANK(E27),ISBLANK(F27)),\"\",'Küldő-Mérlegkör-Elosztó'!$B$5)","v":""}]
[null,21,null,null,null,null,null,null,null,null,null,null,null,null,null,null,null,null,null,null,null,"",null,null,null,null,null,null,null,null,null,null,null,null,null,null,null,null,null,null,null,{"$f":"IF(AND(ISBLANK(E28),ISBLANK(F28)),\"\",'Küldő-Mérlegkör-Elosztó'!$B$6)","v":""},{"$f":"IF(AND(ISBLANK(E28),ISBLANK(F28)),\"\",'Küldő-Mérlegkör-Elosztó'!$B$3)","v":""},{"$f":"IF(AND(ISBLANK(E28),ISBLANK(F28)),\"\",'Küldő-Mérlegkör-Elosztó'!$B$4)","v":""},{"$f":"IF(AND(ISBLANK(E28),ISBLANK(F28)),\"\",'Küldő-Mérlegkör-Elosztó'!$B$5)","v":""}]
[null,22,null,null,null,null,null,null,null,null,null,null,null,null,null,null,null,null,null,null,null,"",null,null,null,null,null,null,null,null,null,null,null,null,null,null,null,null,null,null,null,{"$f":"IF(AND(ISBLANK(E29),ISBLANK(F29)),\"\",'Küldő-Mérlegkör-Elosztó'!$B$6)","v":""},{"$f":"IF(AND(ISBLANK(E29),ISBLANK(F29)),\"\",'Küldő-Mérlegkör-Elosztó'!$B$3)","v":""},{"$f":"IF(AND(ISBLANK(E29),ISBLANK(F29)),\"\",'Küldő-Mérlegkör-Elosztó'!$B$4)","v":""},{"$f":"IF(AND(ISBLANK(E29),ISBLANK(F29)),\"\",'Küldő-Mérlegkör-Elosztó'!$B$5)","v":""}]
[null,23,null,null,null,null,null,null,null,null,null,null,null,null,null,null,null,null,null,null,null,"",null,null,null,null,null,null,null,null,null,null,null,null,null,null,null,null,null,null,null,{"$f":"IF(AND(ISBLANK(E30),ISBLANK(F30)),\"\",'Küldő-Mérlegkör-Elosztó'!$B$6)","v":""},{"$f":"IF(AND(ISBLANK(E30),ISBLANK(F30)),\"\",'Küldő-Mérlegkör-Elosztó'!$B$3)","v":""},{"$f":"IF(AND(ISBLANK(E30),ISBLANK(F30)),\"\",'Küldő-Mérlegkör-Elosztó'!$B$4)","v":""},{"$f":"IF(AND(ISBLANK(E30),ISBLANK(F30)),\"\",'Küldő-Mérlegkör-Elosztó'!$B$5)","v":""}]
{"$rows_left_out":28}
{"sheet":"Beállítás","index":2,"n_rows":239,"n_cols":12,"rows_kept":239,"cut":false,"hidden":false,"merged":[]}
[]
["Lista megnevezése",null,"Elosztók","FelhTípus","ProfilCsop","Mérlegkör","Kereskedő","Mértékegység","RHDfizető","RkLeolv","Státusz","StátuszDSO"]
[null,"Kezdő sorszám",{"$f":"MATCH(C2,$A$1:$A$569,0)+2","v":8},{"$f":"MATCH(D2,$A$1:$A$569,0)+2","v":19},{"$f":"MATCH(E2,$A$1:$A$569,0)+2","v":24},{"$f":"MATCH(F2,$A$1:$A$569,0)+2","v":50},{"$f":"MATCH(G2,$A$1:$A$569,0)+2","v":113},{"$f":"MATCH(H2,$A$1:$A$569,0)+2","v":199},{"$f":"MATCH(I2,$A$1:$A$569,0)+2","v":205},{"$f":"MATCH(J2,$A$1:$A$569,0)+2","v":210},{"$f":"MATCH(K2,$A$1:$A$569,0)+2","v":215},{"$f":"MATCH(L2,$A$1:$A$569,0)+2","v":235}]
[null,"Utolsó sorszám",{"$f":"INDIRECT(\"C\" & (C3-2)) + C3-1","v":15},20,46,109,195,201,206,211,222,239]
[]
["Elosztók",null,{"$f":"COUNTA(B8:B16)","v":8},null,null,null,"Kod","Megnevezes"]
[null,"Megnevezés","Rövidnév","Azonosító",null,null,"1","Hibás POD azonosító"]
[null,"ELMŰ Hálózati Kft","ELMÛ_DER","EHE000210",null,null,"2","Kereskedő küldés dátum eltér a valós küldés dátumtól"]
[null,"ÉMÁSZ Hálózati Kft.","ÉMÁSZ_DER","EHE000220",null,null,"3","Fájlnévben megjelölt T-nap eltér a kijelentés dátumától"]
[null,"ELMŰ-ÉMÁSZ Hálózati Kft.","RWE","EHE000200",null,null,"4","Fájlnévben megjelölt T-nap eltér a bejelentés dátumától"]
[null,"E.ON Észak-dunántúli Áramhálózati Zrt.","EED","EHE000110",null,null,"5","Kijelentés elkésett"]
[null,"E.ON Dél-dunántúli Áramhálózati Zrt.","EDE","EHE000120",null,null,"6","Bejelentés elkésett"]
[null,"E.ON Tiszántúli Áramhálózati Zrt.","ETI","EHE000130",null,null,"7","Hibás vagy hiányzó kereskedői státusz (kötelező)"]
[null,"E.ON Áramhálózati Zrt.","EON","EHE000100",null,null,"8","DSO státusz mező csak üres lehet"]
[null,"NKM Áramhálózati Kft.","Démász","EHE000310",null,null,"9","Ellátás alapú szerződés azonosítója mező üres (kötelező)"]
[null,null,null,null,null,null,"A","Hibás vagy hiányzó RHD fizeto mező"]
["FelhTípus",null,{"$f":"COUNTA(B19:B21)","v":2},null,null,null,"B","Kapcsolat tartó adatai üresek (kötelező)"]
[null,"Megnevezés",null,null,null,null,"C","Hibás Elosztó kiválasztás"]
[null,"Idősoros",null,null,null,null,"D","MP nem azonosítható"]
[null,"Profilos",null,null,null,null,"E","Ismeretlen fogyasztó"]
[null,null,null,null,null,null,"F","FH azonosító eltér"]
["ProfilCsop",null,{"$f":"COUNTA(B24:B47)","v":23},null,null,null,"G","Nem lehetséges több hibajavítás"]
[null,"Megnevezés","Kód","Megnevezés",null,null,"H","Hibajavítás után MP nem lehet ellátatlan"]
[null,"Állandó fogyasztás ","ALL_01 ","Állandó fogyasztás ",null,null,"I","Ismétlődő bejelentés"]
[null,"Általános vezérelt  ELMŰ","VEZELM","Általános vezérelt  ELMŰ",null,null,"J","Rendkívüli kijelentés HI.UTAN SZERZ.FELM feltétele nem teljesül"]
[null,"Általános vezérelt ÉMÁSZ","VEZEMA","Általános vezérelt ÉMÁSZ",null,null,"K","Kereskedő ezt a POD-ot nem jelentheti ki"]
[null,"Csökkentett közvilágítási naptáras","KZVC01","Csökkentett közvilágítási naptáras",null,null,"L","Kereskedői verseny"]
[null,"Kisüzleti 1.","UZL_01","Kisüzleti 1.",null,null,"M","POD nem ellátatlan"]
[null,"Kisüzleti 2.","UZL_02","Kisüzleti 2.",null,null,"N","Nincs MK egység"]
[null,"Kisüzleti 3.","UZL_03","Kisüzleti 3.",null,null,"O","Előre fizetős mérőn kereskedőváltás nem lehetséges"]
{"$rows_left_out":210}
{"sheet":"Munka","index":3,"n_rows":0,"n_cols":0,"rows_kept":0,"cut":false,"hidden":false,"merged":[]}